Reaction Details
TargetTranslocator protein
LigandBDBM50274218
Substrate/Competitorn/a
Meas. Tech.ChEMBL_537932 (CHEMBL983517)
Ki 0.87±n/a nM
Citation Denora, NLaquintana, VPisu, MGDore, RMurru, LLatrofa, ATrapani, GSanna, E 2-Phenyl-imidazo[1,2-a]pyridine compounds containing hydrophilic groups as potent and selective ligands for peripheral benzodiazepine receptors: synthesis, binding affinity and electrophysiological studies. J Med Chem51:6876-88 (2008) 
 
Translocator protein
Name:Translocator protein
Type:Mitochondrion membrane protein
Mol. Mass.:18945.84
Organism:Rattus norvegicus (rat)
Description:Competitive binding experiments were performed on rat kidney mitochondrial membranes.
Residue:169
BDBM50274218
NameBDBM50274218
Synonyms:2-(6,8-Dichloro-2-(4-hydroxyphenyl)imidazo[1,2-a]pyridin-3-yl)-N-buthyl-N-methylacetamide | CHEMBL484574
TypeSmall organic molecule
Emp. Form.C20H21Cl2N3O2
Mol. Mass.406.306
SMILESCCCCN(C)C(=O)Cc1c(nc2c(Cl)cc(Cl)cn12)-c1ccc(O)cc1