Reaction Details
TargetTranslocator protein
LigandBDBM50274260
Substrate/Competitorn/a
Meas. Tech.ChEMBL_537932 (CHEMBL983517)
Ki 0.23±n/a nM
Citation Denora, NLaquintana, VPisu, MGDore, RMurru, LLatrofa, ATrapani, GSanna, E 2-Phenyl-imidazo[1,2-a]pyridine compounds containing hydrophilic groups as potent and selective ligands for peripheral benzodiazepine receptors: synthesis, binding affinity and electrophysiological studies. J Med Chem51:6876-88 (2008) 
 
Translocator protein
Name:Translocator protein
Type:Mitochondrion membrane protein
Mol. Mass.:18945.84
Organism:Rattus norvegicus (rat)
Description:Competitive binding experiments were performed on rat kidney mitochondrial membranes.
Residue:169
BDBM50274260
NameBDBM50274260
Synonyms:2-(6,8-Dichloro-2-(4-methoxyphenyl)imidazo[1,2-a]pyridin-3-yl)-N-methyl-N-phenylacetamide | CHEMBL485606
TypeSmall organic molecule
Emp. Form.C23H19Cl2N3O2
Mol. Mass.440.322
SMILESCOc1ccc(cc1)-c1nc2c(Cl)cc(Cl)cn2c1CC(=O)N(C)c1ccccc1