Reaction Details
TargetTranslocator protein
LigandBDBM50274404
Substrate/Competitorn/a
Meas. Tech.ChEMBL_537932 (CHEMBL983517)
Ki 0.3±n/a nM
Citation Denora, NLaquintana, VPisu, MGDore, RMurru, LLatrofa, ATrapani, GSanna, E 2-Phenyl-imidazo[1,2-a]pyridine compounds containing hydrophilic groups as potent and selective ligands for peripheral benzodiazepine receptors: synthesis, binding affinity and electrophysiological studies. J Med Chem51:6876-88 (2008) 
 
Translocator protein
Name:Translocator protein
Type:Mitochondrion membrane protein
Mol. Mass.:18945.84
Organism:Rattus norvegicus (rat)
Description:Competitive binding experiments were performed on rat kidney mitochondrial membranes.
Residue:169
BDBM50274404
NameBDBM50274404
Synonyms:CHEMBL521180 | N-Butyl-2-(6,8-dichloro-2-(4-chloro-3-nitrophenyl)imidazo[1,2-a]pyridin-3-yl)-N-methylacetamide
TypeSmall organic molecule
Emp. Form.C20H19Cl3N4O3
Mol. Mass.469.749
SMILESCCCCN(C)C(=O)Cc1c(nc2c(Cl)cc(Cl)cn12)-c1ccc(Cl)c(c1)[N+]([O-])=O