Reaction Details
TargetTranslocator protein
LigandBDBM50274485
Substrate/Competitorn/a
Meas. Tech.ChEMBL_537932 (CHEMBL983517)
Ki 1.04±n/a nM
Citation Denora, NLaquintana, VPisu, MGDore, RMurru, LLatrofa, ATrapani, GSanna, E 2-Phenyl-imidazo[1,2-a]pyridine compounds containing hydrophilic groups as potent and selective ligands for peripheral benzodiazepine receptors: synthesis, binding affinity and electrophysiological studies. J Med Chem51:6876-88 (2008) 
 
Translocator protein
Name:Translocator protein
Type:Mitochondrion membrane protein
Mol. Mass.:18945.84
Organism:Rattus norvegicus (rat)
Description:Competitive binding experiments were performed on rat kidney mitochondrial membranes.
Residue:169
BDBM50274485
NameBDBM50274485
Synonyms:2-(2-(3-Amino-4-chlorophenyl)-8-chloroimidazo[1,2-a]pyridin-3-yl)-N-butyl-N-methylacetamide | CHEMBL520847
TypeSmall organic molecule
Emp. Form.C20H22Cl2N4O
Mol. Mass.405.321
SMILESCCCCN(C)C(=O)Cc1c(nc2c(Cl)cccn12)-c1ccc(Cl)c(N)c1