Reaction Details
TargetSodium-dependent serotonin transporter
LigandBDBM50191615
Substrate/Competitorn/a
Meas. Tech.ChEMBL_536731 (CHEMBL984525)
Ki 1.5±n/a nM
Citation Hatzenbuhler, NTBaudy, REvrard, DAFailli, AHarrison, BLLenicek, SMewshaw, RESaab, AShah, USze, JZhang, MZhou, DChlenov, MKagan, MGolembieski, JHornby, GLai, MSmith, DLSullivan, KMSchechter, LEAndree, TH Advances toward new antidepressants with dual serotonin transporter and 5-HT1A receptor affinity within a class of 3-aminochroman derivatives. Part 2. J Med Chem51:6980-7004 (2008) 
 
Sodium-dependent serotonin transporter
Name:Sodium-dependent serotonin transporter
Type:Multi-pass membrane protein
Mol. Mass.:70168.43
Organism:Rattus norvegicus (rat)
Description:P31652
Residue:630
BDBM50191615
NameBDBM50191615
Synonyms:(3R)-(-)-3-{Cyclobutyl[3-(5-fluoro-1H-indol-3-yl)propyl]amino}-8-fluorochromane-5-carboxamide CHEMBL208773
TypeSmall organic molecule
Emp. Form.C25H27F2N3O2
Mol. Mass.439.4976
SMILESNC(=O)c1ccc(F)c2OC[C@@H](Cc12)N(CCCc1c[nH]c2ccc(F)cc12)C1CCC1