Reaction Details
Target5-hydroxytryptamine receptor 1A
LigandBDBM50274186
Substrate/Competitorn/a
Meas. Tech.ChEMBL_536733 (CHEMBL984527)
Ki 0.66±n/a nM
Citation Hatzenbuhler, NTBaudy, REvrard, DAFailli, AHarrison, BLLenicek, SMewshaw, RESaab, AShah, USze, JZhang, MZhou, DChlenov, MKagan, MGolembieski, JHornby, GLai, MSmith, DLSullivan, KMSchechter, LEAndree, TH Advances toward new antidepressants with dual serotonin transporter and 5-HT1A receptor affinity within a class of 3-aminochroman derivatives. Part 2. J Med Chem51:6980-7004 (2008) 
 
5-hydroxytryptamine receptor 1A
Name:5-hydroxytryptamine receptor 1A
Type:n/a
Mol. Mass.:46122.49
Organism:Homo sapiens (Human)
Description:n/a
Residue:422
BDBM50274186
NameBDBM50274186
Synonyms:(+)-3-{Cyclobutyl[3-(5-fluoro-1H-indol-3-yl)propyl]amino}chromane-5-carboxamide CHEMBL484580 | CHEMBL484747
TypeSmall organic molecule
Emp. Form.C25H28FN3O2
Mol. Mass.421.5071
SMILESNC(=O)c1cccc2OCC(Cc12)N(CCCc1c[nH]c2ccc(F)cc12)C1CCC1