Reaction Details
TargetZinc finger protein GLI1
LigandBDBM50377959
Substrate/Competitorn/a
Meas. Tech.ChEMBL_537531 (CHEMBL987100)
IC50>200000±n/a nM
Citation Arai, MATateno, CHosoya, TKoyano, TKowithayakorn, TIshibashi, M Hedgehog/GLI-mediated transcriptional inhibitors from Zizyphus cambodiana. Bioorg Med Chem16:9420-4 (2008) 
 
Zinc finger protein GLI1
Name:Zinc finger protein GLI1
Type:PROTEIN
Mol. Mass.:117920.33
Organism:Homo sapiens (Human)
Description:ChEMBL_537531
Residue:1106
BDBM50377959
NameBDBM50377959
Synonyms:CHEMBL491069
TypeSmall organic molecule
Emp. Form.C30H46O5
Mol. Mass.486.6832
SMILESCC(=C)[C@@H]1CC[C@@]2(CC[C@]3(C)[C@H](CC[C@@H]4[C@@]5(C)[C@H]([C@H](O)C(C)(C)[C@@H]5CC[C@@]34C)C(O)=O)[C@@H]12)C(O)=O