Reaction Details
TargetGalectin-8
LigandBDBM50273431
Substrate/Competitorn/a
Meas. Tech.ChEMBL_560907 (CHEMBL1013542)
Kd 42000±n/a nM
Citation Delaine, TCumpstey, IIngrassia, LLe Mercier, MOkechukwu, PLeffler, HKiss, RNilsson, UJ Galectin-inhibitory thiodigalactoside ester derivatives have antimigratory effects in cultured lung and prostate cancer cells. J Med Chem51:8109-14 (2008) 
 
Galectin-8
Name:Galectin-8
Type:PROTEIN
Mol. Mass.:35814.23
Organism:Homo sapiens (Human)
Description:ChEMBL_1454625
Residue:317
BDBM50273431
NameBDBM50273431
Synonyms:Bis-[3-O-(3-methoxybenzoyl)-beta-D-galactopyranosyl]sulfane | CHEMBL509915
TypeSmall organic molecule
Emp. Form.C28H34O14S
Mol. Mass.626.626
SMILESCOc1cccc(c1)C(=O)O[C@H]1[C@@H](O)[C@@H](CO)O[C@@H](S[C@@H]2O[C@H](CO)[C@H](O)[C@H](OC(=O)c3cccc(OC)c3)[C@H]2O)[C@@H]1O