Reaction Details
TargetGalectin-8
LigandBDBM50273583
Substrate/Competitorn/a
Meas. Tech.ChEMBL_560907 (CHEMBL1013542)
Kd 530000±n/a nM
Citation Delaine, TCumpstey, IIngrassia, LLe Mercier, MOkechukwu, PLeffler, HKiss, RNilsson, UJ Galectin-inhibitory thiodigalactoside ester derivatives have antimigratory effects in cultured lung and prostate cancer cells. J Med Chem51:8109-14 (2008) 
 
Galectin-8
Name:Galectin-8
Type:PROTEIN
Mol. Mass.:35814.23
Organism:Homo sapiens (Human)
Description:ChEMBL_1454625
Residue:317
BDBM50273583
NameBDBM50273583
Synonyms:(2R,3R,4S,5S,6R)-4-hydroxy-6-(hydroxymethyl)-2-methoxy-5-((2S,3R,4S,5R,6R)-3,4,5-trihydroxy-6-(hydroxymethyl)-tetrahydro-2H-pyran-2-yloxy)-tetrahydro-2H-pyran-3-yl 1-naphthoate | CHEMBL457430
TypeSmall organic molecule
Emp. Form.C24H30O12
Mol. Mass.510.4878
SMILESCO[C@@H]1O[C@H](CO)[C@@H](O[C@@H]2O[C@H](CO)[C@H](O)[C@H](O)[C@H]2O)[C@H](O)[C@H]1OC(=O)c1cccc2ccccc12