Reaction Details
TargetGalectin-8
LigandBDBM50370453
Substrate/Competitorn/a
Meas. Tech.ChEMBL_560907 (CHEMBL1013542)
Kd 62000±n/a nM
Citation Delaine, TCumpstey, IIngrassia, LLe Mercier, MOkechukwu, PLeffler, HKiss, RNilsson, UJ Galectin-inhibitory thiodigalactoside ester derivatives have antimigratory effects in cultured lung and prostate cancer cells. J Med Chem51:8109-14 (2008) 
 
Galectin-8
Name:Galectin-8
Type:PROTEIN
Mol. Mass.:35814.23
Organism:Homo sapiens (Human)
Description:ChEMBL_1454625
Residue:317
BDBM50370453
NameBDBM50370453
Synonyms:LACTOSE | Lactose, anhydrous
TypeSmall organic molecule
Emp. Form.C12H22O11
Mol. Mass.342.2965
SMILESOC[C@H]1O[C@@H](O[C@H]2[C@H](O)[C@@H](O)[C@H](O)O[C@@H]2CO)[C@H](O)[C@@H](O)[C@H]1O