Reaction Details
TargetPolyunsaturated fatty acid 5-lipoxygenase
LigandBDBM24560
Substrate/Competitorn/a
Meas. Tech.ChEMBL_560974 (CHEMBL1014421)
IC50 6500±n/a nM
Citation Koeberle, AZettl, HGreiner, CWurglics, MSchubert-Zsilavecz, MWerz, O Pirinixic acid derivatives as novel dual inhibitors of microsomal prostaglandin E2 synthase-1 and 5-lipoxygenase. J Med Chem51:8068-76 (2008) 
 
Polyunsaturated fatty acid 5-lipoxygenase
Name:Polyunsaturated fatty acid 5-lipoxygenase
Type:Enzyme
Mol. Mass.:77972.74
Organism:Homo sapiens (Human)
Description:Recombinant protein was purified from E. coli lysate. After ammonium sulfate precipitation and subsequent steps, the supernatant (S100) was used for 5-LO activity assay.
Residue:674
BDBM24560
NameBDBM24560
Synonyms:2-({4-chloro-6-[(2,3-dimethylphenyl)amino]pyrimidin-2-yl}sulfanyl)octanoic acid Pirinixic acid-based compound, 6a
TypeSmall organic molecule
Emp. Form.C20H26ClN3O2S
Mol. Mass.407.957
SMILESCCCCCCC(Sc1nc(Cl)cc(Nc2cccc(C)c2C)n1)C(O)=O