Reaction Details
TargetPolyunsaturated fatty acid 5-lipoxygenase
LigandBDBM24561
Substrate/Competitorn/a
Meas. Tech.ChEMBL_560974 (CHEMBL1014421)
IC50 19000±n/a nM
Citation Koeberle, AZettl, HGreiner, CWurglics, MSchubert-Zsilavecz, MWerz, O Pirinixic acid derivatives as novel dual inhibitors of microsomal prostaglandin E2 synthase-1 and 5-lipoxygenase. J Med Chem51:8068-76 (2008) 
 
Polyunsaturated fatty acid 5-lipoxygenase
Name:Polyunsaturated fatty acid 5-lipoxygenase
Type:Enzyme
Mol. Mass.:77972.74
Organism:Homo sapiens (Human)
Description:Recombinant protein was purified from E. coli lysate. After ammonium sulfate precipitation and subsequent steps, the supernatant (S100) was used for 5-LO activity assay.
Residue:674
BDBM24561
NameBDBM24561
Synonyms:CHEMBL459722 ethyl 2-{[4-chloro-6-(quinolin-6-ylamino)pyrimidin-2-yl]sulfanyl}octanoate
TypeSmall organic molecule
Emp. Form.C23H27ClN4O2S
Mol. Mass.459.004
SMILESCCCCCCC(Sc1nc(Cl)cc(Nc2ccc3ncccc3c2)n1)C(=O)OCC