Reaction Details
TargetProstaglandin G/H synthase 1
LigandBDBM22334
Substrate/Competitorn/a
Meas. Tech.ChEMBL_560977 (CHEMBL1014424)
IC50>10±n/a nM
Citation Koeberle, AZettl, HGreiner, CWurglics, MSchubert-Zsilavecz, MWerz, O Pirinixic acid derivatives as novel dual inhibitors of microsomal prostaglandin E2 synthase-1 and 5-lipoxygenase. J Med Chem51:8068-76 (2008) 
 
Prostaglandin G/H synthase 1
Name:Prostaglandin G/H synthase 1
Type:Protein
Mol. Mass.:68868.60
Organism:Ovis aries (Sheep)
Description:n/a
Residue:600
BDBM22334
NameBDBM22334
Synonyms:BW A4C BWA4C CHEMBL314360 N-(3-phenoxycinnamyl)acetohydroxamic acid | N-hydroxy-N-[(2E)-3-(3-phenoxyphenyl)prop-2-en-1-yl]acetamide
TypeSmall organic molecule
Emp. Form.C17H17NO3
Mol. Mass.283.3218
SMILESCC(=O)N(O)C\C=C\c1cccc(Oc2ccccc2)c1