Reaction Details
TargetProstaglandin G/H synthase 1
LigandBDBM50273388
Substrate/Competitorn/a
Meas. Tech.ChEMBL_560977 (CHEMBL1014424)
IC50>10±n/a nM
Citation Koeberle, AZettl, HGreiner, CWurglics, MSchubert-Zsilavecz, MWerz, O Pirinixic acid derivatives as novel dual inhibitors of microsomal prostaglandin E2 synthase-1 and 5-lipoxygenase. J Med Chem51:8068-76 (2008) 
 
Prostaglandin G/H synthase 1
Name:Prostaglandin G/H synthase 1
Type:Protein
Mol. Mass.:68868.60
Organism:Ovis aries (Sheep)
Description:n/a
Residue:600
BDBM50273388
NameBDBM50273388
Synonyms:CHEMBL456575 | Ethyl 2-(4-(biphenyl-4-ylmethylamino)-6-chloropyrimidin-2-ylthio)octanoate
TypeSmall organic molecule
Emp. Form.C27H32ClN3O2S
Mol. Mass.498.08
SMILESCCCCCCC(Sc1nc(Cl)cc(NCc2ccc(cc2)-c2ccccc2)n1)C(=O)OCC