Reaction Details
TargetProstaglandin G/H synthase 1
LigandBDBM24561
Substrate/Competitorn/a
Meas. Tech.ChEMBL_560977 (CHEMBL1014424)
IC50>10±n/a nM
Citation Koeberle, AZettl, HGreiner, CWurglics, MSchubert-Zsilavecz, MWerz, O Pirinixic acid derivatives as novel dual inhibitors of microsomal prostaglandin E2 synthase-1 and 5-lipoxygenase. J Med Chem51:8068-76 (2008) 
 
Prostaglandin G/H synthase 1
Name:Prostaglandin G/H synthase 1
Type:Protein
Mol. Mass.:68868.60
Organism:Ovis aries (Sheep)
Description:n/a
Residue:600
BDBM24561
NameBDBM24561
Synonyms:CHEMBL459722 ethyl 2-{[4-chloro-6-(quinolin-6-ylamino)pyrimidin-2-yl]sulfanyl}octanoate
TypeSmall organic molecule
Emp. Form.C23H27ClN4O2S
Mol. Mass.459.004
SMILESCCCCCCC(Sc1nc(Cl)cc(Nc2ccc3ncccc3c2)n1)C(=O)OCC