Reaction Details
TargetProstaglandin G/H synthase 1
LigandBDBM24560
Substrate/Competitorn/a
Meas. Tech.ChEMBL_560977 (CHEMBL1014424)
IC50>10±n/a nM
Citation Koeberle, AZettl, HGreiner, CWurglics, MSchubert-Zsilavecz, MWerz, O Pirinixic acid derivatives as novel dual inhibitors of microsomal prostaglandin E2 synthase-1 and 5-lipoxygenase. J Med Chem51:8068-76 (2008) 
 
Prostaglandin G/H synthase 1
Name:Prostaglandin G/H synthase 1
Type:Protein
Mol. Mass.:68868.60
Organism:Ovis aries (Sheep)
Description:n/a
Residue:600
BDBM24560
NameBDBM24560
Synonyms:2-({4-chloro-6-[(2,3-dimethylphenyl)amino]pyrimidin-2-yl}sulfanyl)octanoic acid Pirinixic acid-based compound, 6a
TypeSmall organic molecule
Emp. Form.C20H26ClN3O2S
Mol. Mass.407.957
SMILESCCCCCCC(Sc1nc(Cl)cc(Nc2cccc(C)c2C)n1)C(O)=O