Reaction Details
TargetProstaglandin G/H synthase 1
LigandBDBM50273681
Substrate/Competitorn/a
Meas. Tech.ChEMBL_560977 (CHEMBL1014424)
IC50>10±n/a nM
Citation Koeberle, AZettl, HGreiner, CWurglics, MSchubert-Zsilavecz, MWerz, O Pirinixic acid derivatives as novel dual inhibitors of microsomal prostaglandin E2 synthase-1 and 5-lipoxygenase. J Med Chem51:8068-76 (2008) 
 
Prostaglandin G/H synthase 1
Name:Prostaglandin G/H synthase 1
Type:Protein
Mol. Mass.:68868.60
Organism:Ovis aries (Sheep)
Description:n/a
Residue:600
BDBM50273681
NameBDBM50273681
Synonyms:2-(4-chloro-6-(2,3-dimethylphenylamino)pyrimidin-2-ylthio)hexanoic acid | CHEMBL459972
TypeSmall organic molecule
Emp. Form.C18H22ClN3O2S
Mol. Mass.379.904
SMILESCCCCC(Sc1nc(Cl)cc(Nc2cccc(C)c2C)n1)C(O)=O