Reaction Details
TargetProstaglandin G/H synthase 2
LigandBDBM50273442
Substrate/Competitorn/a
Meas. Tech.ChEMBL_561220 (CHEMBL1012766)
IC50>10±n/a nM
Citation Koeberle, AZettl, HGreiner, CWurglics, MSchubert-Zsilavecz, MWerz, O Pirinixic acid derivatives as novel dual inhibitors of microsomal prostaglandin E2 synthase-1 and 5-lipoxygenase. J Med Chem51:8068-76 (2008) 
 
Prostaglandin G/H synthase 2
Name:Prostaglandin G/H synthase 2
Type:Enzyme
Mol. Mass.:69003.89
Organism:Homo sapiens (Human)
Description:Recombinant Cox-2 provided by Cayman (Cayman Chemical Co.,Ann Arbor, MI).
Residue:604
BDBM50273442
NameBDBM50273442
Synonyms:2-(4-Chloro-6-(5-methoxy-2-methylbiphenyl-4-ylamino)pyrimidin-2-ylthio)octanoic acid | CHEMBL463776
TypeSmall organic molecule
Emp. Form.C26H30ClN3O3S
Mol. Mass.500.053
SMILESCCCCCCC(Sc1nc(Cl)cc(Nc2cc(C)c(cc2OC)-c2ccccc2)n1)C(O)=O