Reaction Details
TargetProstaglandin G/H synthase 2
LigandBDBM50273390
Substrate/Competitorn/a
Meas. Tech.ChEMBL_561220 (CHEMBL1012766)
IC50>10±n/a nM
Citation Koeberle, AZettl, HGreiner, CWurglics, MSchubert-Zsilavecz, MWerz, O Pirinixic acid derivatives as novel dual inhibitors of microsomal prostaglandin E2 synthase-1 and 5-lipoxygenase. J Med Chem51:8068-76 (2008) 
 
Prostaglandin G/H synthase 2
Name:Prostaglandin G/H synthase 2
Type:Enzyme
Mol. Mass.:69003.89
Organism:Homo sapiens (Human)
Description:Recombinant Cox-2 provided by Cayman (Cayman Chemical Co.,Ann Arbor, MI).
Residue:604
BDBM50273390
NameBDBM50273390
Synonyms:(S)-2-(4-Chloro-6-(4'-cyanobiphenyl-4-ylamino)pyrimidin-2-ylthio)octanoic acid | CHEMBL456800
TypeSmall organic molecule
Emp. Form.C25H25ClN4O2S
Mol. Mass.481.01
SMILESCCCCCC[C@H](Sc1nc(Cl)cc(Nc2ccc(cc2)-c2ccc(cc2)C#N)n1)C(O)=O