Reaction Details
TargetProstaglandin G/H synthase 2
LigandBDBM24565
Substrate/Competitorn/a
Meas. Tech.ChEMBL_561220 (CHEMBL1012766)
IC50>10±n/a nM
Citation Koeberle, AZettl, HGreiner, CWurglics, MSchubert-Zsilavecz, MWerz, O Pirinixic acid derivatives as novel dual inhibitors of microsomal prostaglandin E2 synthase-1 and 5-lipoxygenase. J Med Chem51:8068-76 (2008) 
 
Prostaglandin G/H synthase 2
Name:Prostaglandin G/H synthase 2
Type:Enzyme
Mol. Mass.:69003.89
Organism:Homo sapiens (Human)
Description:Recombinant Cox-2 provided by Cayman (Cayman Chemical Co.,Ann Arbor, MI).
Residue:604
BDBM24565
NameBDBM24565
Synonyms:2-({4-chloro-6-[(quinolin-6-ylmethyl)amino]pyrimidin-2-yl}sulfanyl)octanoic acid Pirinixic acid-based compound, 6g
TypeSmall organic molecule
Emp. Form.C22H25ClN4O2S
Mol. Mass.444.978
SMILESCCCCCCC(Sc1nc(Cl)cc(NCc2ccc3ncccc3c2)n1)C(O)=O