Reaction Details
TargetProstaglandin G/H synthase 2
LigandBDBM24560
Substrate/Competitorn/a
Meas. Tech.ChEMBL_561220 (CHEMBL1012766)
IC50>10±n/a nM
Citation Koeberle, AZettl, HGreiner, CWurglics, MSchubert-Zsilavecz, MWerz, O Pirinixic acid derivatives as novel dual inhibitors of microsomal prostaglandin E2 synthase-1 and 5-lipoxygenase. J Med Chem51:8068-76 (2008) 
 
Prostaglandin G/H synthase 2
Name:Prostaglandin G/H synthase 2
Type:Enzyme
Mol. Mass.:69003.89
Organism:Homo sapiens (Human)
Description:Recombinant Cox-2 provided by Cayman (Cayman Chemical Co.,Ann Arbor, MI).
Residue:604
BDBM24560
NameBDBM24560
Synonyms:2-({4-chloro-6-[(2,3-dimethylphenyl)amino]pyrimidin-2-yl}sulfanyl)octanoic acid Pirinixic acid-based compound, 6a
TypeSmall organic molecule
Emp. Form.C20H26ClN3O2S
Mol. Mass.407.957
SMILESCCCCCCC(Sc1nc(Cl)cc(Nc2cccc(C)c2C)n1)C(O)=O