Reaction Details
TargetProstaglandin G/H synthase 2
LigandBDBM50273680
Substrate/Competitorn/a
Meas. Tech.ChEMBL_561220 (CHEMBL1012766)
IC50>10±n/a nM
Citation Koeberle, AZettl, HGreiner, CWurglics, MSchubert-Zsilavecz, MWerz, O Pirinixic acid derivatives as novel dual inhibitors of microsomal prostaglandin E2 synthase-1 and 5-lipoxygenase. J Med Chem51:8068-76 (2008) 
 
Prostaglandin G/H synthase 2
Name:Prostaglandin G/H synthase 2
Type:Enzyme
Mol. Mass.:69003.89
Organism:Homo sapiens (Human)
Description:Recombinant Cox-2 provided by Cayman (Cayman Chemical Co.,Ann Arbor, MI).
Residue:604
BDBM50273680
NameBDBM50273680
Synonyms:2-(4-chloro-6-(2,3-dimethylphenylamino)pyrimidin-2-ylthio)-2-methylpropanoic acid | CHEMBL512563
TypeSmall organic molecule
Emp. Form.C16H18ClN3O2S
Mol. Mass.351.851
SMILESCc1cccc(Nc2cc(Cl)nc(SC(C)(C)C(O)=O)n2)c1C