Reaction Details
TargetGalanin receptor type 1
LigandBDBM50273361
Substrate/Competitorn/a
Meas. Tech.ChEMBL_561974 (CHEMBL1010037)
Ki 22±n/a nM
Citation Bulaj, GGreen, BRLee, HKRobertson, CRWhite, KZhang, LSochanska, MFlynn, SPScholl, EAPruess, THSmith, MDWhite, HS Design, synthesis, and characterization of high-affinity, systemically-active galanin analogues with potent anticonvulsant activities. J Med Chem51:8038-47 (2008) 
 
Galanin receptor type 1
Name:Galanin receptor type 1
Type:Enzyme Catalytic Domain
Mol. Mass.:38976.60
Organism:Homo sapiens (Human)
Description:Galanin R1 GALR1 HUMAN::P47211
Residue:349
BDBM50273361
NameBDBM50273361
Synonyms:(S)-N-((S)-6-amino-1-((S)-6-amino-1-((S)-1-((S)-1,6-diamino-1-oxohexan-2-ylamino)-1-oxo-6-palmitamidohexan-2-ylamino)-1-oxohexan-2-ylamino)-1-oxohexan-2-yl)-1-(2-((S)-2-((S)-2-((S)-2-(2-((S)-2-((S)-2-((S)-4-amino-2-((S)-2-((2S,3R)-2-((S)-2-(6-aminohexanamido)-3-(1H-indol-3-yl)propanamido)-3-hydroxybutanamido)-4-methylpentanamido)-4-oxobutanamido)-3-hydroxypropanamido)propanamido)acetamido)-3-(4-hydroxyphenyl)propanamido)-4-methylpentanamido)-4-methylpentanamido)acetyl)pyrrolidine-2-carboxamide | CHEMBL504758
TypeSmall organic molecule
Emp. Form.C107H180N24O22
Mol. Mass.2154.7217
(=O)NCCCC[C@H](NC(=O)[C@H](CCCCN)NC(=O)[C@H](CCCCN)NC(=O)[C@@H]1CCCN1C(=O)CNC(=O)[C@H](CC(C)C)NC(=O)[C@H](CC(C)C)NC(=O)[C@H](Cc1ccc(O)cc1)NC(=O)CNC(=O)[C@H](C)NC(=O)[C@H](CO)NC(=O)[C@H](CC(N)=O)NC(=O)[C@H](CC(C)C)NC(=O)[C@@H](NC(=O)[C@H](Cc1c[nH]c2ccccc12)NC(=O)CCCCCN)[C@@H](C)O)C(=O)N[C@@H](CCCCN)C(N)=O