Reaction Details
TargetGalanin receptor type 1
LigandBDBM50273367
Substrate/Competitorn/a
Meas. Tech.ChEMBL_561969 (CHEMBL1010032)
Kd 3.2±n/a nM
Citation Bulaj, GGreen, BRLee, HKRobertson, CRWhite, KZhang, LSochanska, MFlynn, SPScholl, EAPruess, THSmith, MDWhite, HS Design, synthesis, and characterization of high-affinity, systemically-active galanin analogues with potent anticonvulsant activities. J Med Chem51:8038-47 (2008) 
 
Galanin receptor type 1
Name:Galanin receptor type 1
Type:Enzyme Catalytic Domain
Mol. Mass.:38976.60
Organism:Homo sapiens (Human)
Description:Galanin R1 GALR1 HUMAN::P47211
Residue:349
BDBM50273367
NameBDBM50273367
Synonyms:(2S,3S)-2-((S)-2-((S)-2-((S)-1-(2-((S)-2-((S)-2-((S)-2-(2-((S)-2-((S)-2-((S)-4-amino-2-((S)-2-((2S,3R)-2-((S)-2-(2-aminoacetamido)-3-(1H-indol-3-yl)propanamido)-3-hydroxybutanamido)-4-methylpentanamido)-4-oxobutanamido)-3-hydroxypropanamido)propanamido)acetamido)-3-(4-hydroxyphenyl)propanamido)-4-methylpentanamido)-4-methylpentanamido)acetyl)pyrrolidine-2-carboxamido)-3-(1H-imidazol-5-yl)propanamido)propanamido)-3-methylpentanoic acid Galanin (1-16) Galanin (1-16), rat
TypeSmall organic molecule
Emp. Form.C78H116N20O21
Mol. Mass.1669.877
SMILESCC[C@H](C)[C@H](NC(=O)[C@H](C)NC(=O)[C@H](Cc1cnc[nH]1)NC(=O)[C@@H]1CCCN1C(=O)CNC(=O)[C@H](CC(C)C)NC(=O)[C@H](CC(C)C)NC(=O)[C@H](Cc1ccc(O)cc1)NC(=O)CNC(=O)[C@H](C)NC(=O)[C@H](CO)NC(=O)[C@H](CC(N)=O)NC(=O)[C@H](CC(C)C)NC(=O)[C@@H](NC(=O)[C@H](Cc1c[nH]c2ccccc12)NC(=O)CN)[C@@H](C)O)C(O)=O