Reaction Details
TargetGalanin receptor type 3
LigandBDBM50273370
Substrate/Competitorn/a
Meas. Tech.ChEMBL_561971 (CHEMBL1010034)
Kd 15±n/a nM
Citation Bulaj, GGreen, BRLee, HKRobertson, CRWhite, KZhang, LSochanska, MFlynn, SPScholl, EAPruess, THSmith, MDWhite, HS Design, synthesis, and characterization of high-affinity, systemically-active galanin analogues with potent anticonvulsant activities. J Med Chem51:8038-47 (2008) 
 
Galanin receptor type 3
Name:Galanin receptor type 3
Type:Enzyme Catalytic Domain
Mol. Mass.:39599.97
Organism:Homo sapiens (Human)
Description:Galanin R3 GALR3 HUMAN::O60755
Residue:368
BDBM50273370
NameBDBM50273370
Synonyms:CHEMBL503473 Galanin (1-13)-bradikinin(2-9) M35
TypeSmall organic molecule
Emp. Form.C107H153N27O26
Mol. Mass.2233.525
SMILESCC(C)C[C@H](NC(=O)[C@H](CC(C)C)NC(=O)[C@H](Cc1ccc(O)cc1)NC(=O)CNC(=O)[C@H](C)NC(=O)[C@H](CO)NC(=O)[C@H](CC(N)=O)NC(=O)[C@H](CC(C)C)NC(=O)[C@@H](NC(=O)[C@H](Cc1c[nH]c2ccccc12)NC(=O)CN)[C@@H](C)O)C(=O)NCC(=O)N1CCC[C@H]1C(=O)N1CCC[C@H]1C(=O)N1CCC[C@H]1C(=O)NCC(=O)N[C@@H](Cc1ccccc1)C(=O)N[C@@H](CO)C(=O)N1CCC[C@H]1C(=O)N[C@@H](Cc1ccccc1)C(=O)N[C@@H](CCCN=C(N)N)C(N)=O