Reaction Details
TargetPurine nucleoside phosphorylase
LigandBDBM50246590
Substrate/Competitorn/a
Meas. Tech.ChEMBL_557942 (CHEMBL963040)
Ki 0.117±n/a nM
Citation Murkin, ASClinch, KMason, JMTyler, PCSchramm, VL Immucillins in custom catalytic-site cavities. Bioorg Med Chem Lett18:5900-3 (2008) 
 
Purine nucleoside phosphorylase
Name:Purine nucleoside phosphorylase
Type:Enzyme
Mol. Mass.:32119.53
Organism:Homo sapiens (Human)
Description:n/a
Residue:289
BDBM50246590
NameBDBM50246590
Synonyms:7-(((3R,4S)-3-hydroxy-4-(propylthiomethyl)pyrrolidin-1-yl)methyl)-3H-pyrrolo[3,2-d]pyrimidin-4(5H)-one | CHEMBL443968
TypeSmall organic molecule
Emp. Form.C15H22N4O2S
Mol. Mass.322.426
SMILESCCCSC[C@H]1CN(Cc2c[nH]c3c2nc[nH]c3=O)C[C@@H]1O