Reaction Details
TargetPurine nucleoside phosphorylase
LigandBDBM50246593
Substrate/Competitorn/a
Meas. Tech.ChEMBL_557943 (CHEMBL963041)
Ki 0.0052±n/a nM
Citation Murkin, ASClinch, KMason, JMTyler, PCSchramm, VL Immucillins in custom catalytic-site cavities. Bioorg Med Chem Lett18:5900-3 (2008) 
 
Purine nucleoside phosphorylase
Name:Purine nucleoside phosphorylase
Type:Enzyme
Mol. Mass.:32119.53
Organism:Homo sapiens (Human)
Description:n/a
Residue:289
BDBM50246593
NameBDBM50246593
Synonyms:7-((1,3-dihydroxypropan-2-ylamino)methyl)-3H-pyrrolo[3,2-d]pyrimidin-4(5H)-one CHEMBL505564 | Immucillins, 4
TypeSmall organic molecule
Emp. Form.C10H14N4O3
Mol. Mass.238.2432
SMILESOCC(CO)NCc1c[nH]c2c1nc[nH]c2=O