Reaction Details
Target3-oxoacyl-[acyl-carrier-protein] synthase 3
LigandBDBM50245829
Substrate/Competitorn/a
Meas. Tech.ChEMBL_559691 (CHEMBL1010089)
IC50 3.53±n/a nM
Citation Alhamadsheh, MMWaters, NCSachdeva, SLee, PReynolds, KA Synthesis and biological evaluation of novel sulfonyl-naphthalene-1,4-diols as FabH inhibitors. Bioorg Med Chem Lett18:6402-5 (2008) 
 
3-oxoacyl-[acyl-carrier-protein] synthase 3
Name:3-oxoacyl-[acyl-carrier-protein] synthase 3
Type:Enzyme
Mol. Mass.:34865.07
Organism:Mycobacterium tuberculosis
Description:P9WNG3
Residue:335
BDBM50245829
NameBDBM50245829
Synonyms:2-(methylsulfonyl)naphthalene-1,4-diol | CHEMBL491752
TypeSmall organic molecule
Emp. Form.C11H10O4S
Mol. Mass.238.26
SMILESCS(=O)(=O)c1cc(O)c2ccccc2c1O