Reaction Details
Target3-oxoacyl-[acyl-carrier-protein] synthase 3
LigandBDBM50245830
Substrate/Competitorn/a
Meas. Tech.ChEMBL_559691 (CHEMBL1010089)
IC50 3.53±n/a nM
Citation Alhamadsheh, MMWaters, NCSachdeva, SLee, PReynolds, KA Synthesis and biological evaluation of novel sulfonyl-naphthalene-1,4-diols as FabH inhibitors. Bioorg Med Chem Lett18:6402-5 (2008) 
 
3-oxoacyl-[acyl-carrier-protein] synthase 3
Name:3-oxoacyl-[acyl-carrier-protein] synthase 3
Type:Enzyme
Mol. Mass.:34865.07
Organism:Mycobacterium tuberculosis
Description:P9WNG3
Residue:335
BDBM50245830
NameBDBM50245830
Synonyms:3-(1,4-dihydroxynaphthalen-2-ylsulfonyl)propanoic acid | CHEMBL455414
TypeSmall organic molecule
Emp. Form.C13H12O6S
Mol. Mass.296.296
SMILESOC(=O)CCS(=O)(=O)c1cc(O)c2ccccc2c1O