Reaction Details
TargetCalcitonin gene-related peptide type 1 receptor
LigandBDBM50255069
Substrate/Competitorn/a
Meas. Tech.ChEMBL_560218 (CHEMBL1015393)
Ki 0.21±n/a nM
Citation Stump, CABell, IMBednar, RABruno, JGFay, JFGallicchio, SNJohnston, VKMoore, ELMosser, SDQuigley, AGSalvatore, CATheberge, CRBlair Zartman, CZhang, XFKane, SAGraham, SLVacca, JPWilliams, TM The discovery of highly potent CGRP receptor antagonists. Bioorg Med Chem Lett19:214-7 (2008) 
 
Calcitonin gene-related peptide type 1 receptor
Name:Calcitonin gene-related peptide type 1 receptor
Type:Enzyme Catalytic Domain
Mol. Mass.:52980.45
Organism:Homo sapiens (Human)
Description:Q16602
Residue:461
BDBM50255069
NameBDBM50255069
Synonyms:(S)-2-(5,7-dimethyl-2-oxo-3-(2-oxo-2-(2'-oxo-1,1',2',3-tetrahydrospiro[indene-2,3'-pyrrolo[2,3-b]pyridine]-5-ylamino)ethyl)-2,3-dihydro-1H-benzo[d]imidazol-1-yl)-N,N-dimethylacetamide | CHEMBL517467
TypeSmall organic molecule
Emp. Form.C30H30N6O4
Mol. Mass.538.597
SMILESCN(C)C(=O)Cn1c2c(C)cc(C)cc2n(CC(=O)Nc2ccc3C[C@@]4(Cc3c2)C(=O)Nc2ncccc42)c1=O