Reaction Details
TargetCalcitonin gene-related peptide type 1 receptor
LigandBDBM50254445
Substrate/Competitorn/a
Meas. Tech.ChEMBL_560220 (CHEMBL1015395)
IC50 0.62±n/a nM
Citation Stump, CABell, IMBednar, RABruno, JGFay, JFGallicchio, SNJohnston, VKMoore, ELMosser, SDQuigley, AGSalvatore, CATheberge, CRBlair Zartman, CZhang, XFKane, SAGraham, SLVacca, JPWilliams, TM The discovery of highly potent CGRP receptor antagonists. Bioorg Med Chem Lett19:214-7 (2008) 
 
Calcitonin gene-related peptide type 1 receptor
Name:Calcitonin gene-related peptide type 1 receptor
Type:Enzyme Catalytic Domain
Mol. Mass.:52980.45
Organism:Homo sapiens (Human)
Description:Q16602
Residue:461
BDBM50254445
NameBDBM50254445
Synonyms:(S)-2-(2,5-dioxo-2,4,5,6-tetrahydro-1H-imidazo[1,5,4-de]quinoxalin-1-yl)-N-(2'-oxo-1,1',2',3-tetrahydrospiro[indene-2,3'-pyrrolo[2,3-b]pyridine]-5-yl)acetamide | CHEMBL512773
TypeSmall organic molecule
Emp. Form.C26H20N6O4
Mol. Mass.480.4748
SMILESO=C(Cn1c2cccc3NC(=O)Cn(c23)c1=O)Nc1ccc2C[C@@]3(Cc2c1)C(=O)Nc1ncccc31