Reaction Details
TargetSodium-dependent serotonin transporter
LigandBDBM30126
Substrate/Competitorn/a
Meas. Tech.ChEMBL_560771 (CHEMBL1011738)
IC50>100000±n/a nM
Citation Cashman, JRVoelker, TJohnson, RJanowsky, A Stereoselective inhibition of serotonin re-uptake and phosphodiesterase by dual inhibitors as potential agents for depression. Bioorg Med Chem17:337-43 (2008) 
 
Sodium-dependent serotonin transporter
Name:Sodium-dependent serotonin transporter
Type:Multi-pass membrane protein
Mol. Mass.:70322.51
Organism:Homo sapiens (Human)
Description:P31645
Residue:630
BDBM30126
NameBDBM30126
Synonyms:CHEMBL313041 | phthalazinone, 19
TypeSmall organic molecule
Emp. Form.C16H18N2O3
Mol. Mass.286.3257
SMILESCOc1ccc(cc1OC)C1=NNC(=O)C2CC=CCC12