Reaction Details
TargetSodium-dependent dopamine transporter
LigandBDBM50254790
Substrate/Competitorn/a
Meas. Tech.ChEMBL_560767 (CHEMBL1011734)
Ki 4544±n/a nM
Citation Cashman, JRVoelker, TJohnson, RJanowsky, A Stereoselective inhibition of serotonin re-uptake and phosphodiesterase by dual inhibitors as potential agents for depression. Bioorg Med Chem17:337-43 (2008) 
 
Sodium-dependent dopamine transporter
Name:Sodium-dependent dopamine transporter
Type:Multi-pass membrane protein
Mol. Mass.:68497.11
Organism:Homo sapiens (Human)
Description:Q01959
Residue:620
BDBM50254790
NameBDBM50254790
Synonyms:(S)-Norfluoxetine NORFLUOXETINE
TypeSmall organic molecule
Emp. Form.C16H16F3NO
Mol. Mass.295.2995
SMILESNCC[C@H](Oc1ccc(cc1)C(F)(F)F)c1ccccc1