Reaction Details
TargetSodium-dependent noradrenaline transporter
LigandBDBM30127
Substrate/Competitorn/a
Meas. Tech.ChEMBL_560769 (CHEMBL1011736)
Ki 39119±n/a nM
Citation Cashman, JRVoelker, TJohnson, RJanowsky, A Stereoselective inhibition of serotonin re-uptake and phosphodiesterase by dual inhibitors as potential agents for depression. Bioorg Med Chem17:337-43 (2008) 
 
Sodium-dependent noradrenaline transporter
Name:Sodium-dependent noradrenaline transporter
Type:Multi-pass membrane protein
Mol. Mass.:69337.72
Organism:Homo sapiens (Human)
Description:P23975
Residue:617
BDBM30127
NameBDBM30127
Synonyms:CHEMBL480988 | phthalazinone, 20
TypeSmall organic molecule
Emp. Form.C21H27BrN2O3
Mol. Mass.435.355
SMILESCOc1ccc(cc1OC)C1=NN(CCCCCBr)C(=O)C2CC=CCC12