Reaction Details
TargetDelta-type opioid receptor
LigandBDBM50254575
Substrate/Competitorn/a
Meas. Tech.ChEMBL_558748 (CHEMBL1019877)
Ki>10000±n/a nM
Citation Wentland, MPLou, RLu, QBu, YVanAlstine, MACohen, DJBidlack, JM Syntheses and opioid receptor binding properties of carboxamido-substituted opioids. Bioorg Med Chem Lett19:203-8 (2008) 
 
Delta-type opioid receptor
Name:Delta-type opioid receptor
Type:G Protein-Coupled Receptor (GPCR)
Mol. Mass.:40382.98
Organism:Homo sapiens (Human)
Description:Competition binding assays were carried out using membrane preparations from transfected HN9.10 cells that constitutively expressed the delta opioid receptor.
Residue:372
BDBM50254575
NameBDBM50254575
Synonyms:(1S,5R,13S,14S,17R)-14-hydroxy-4-(prop-2-en-1-yl)-12-oxa-4-azapentacyclo[9.6.1.0^{1,13}.0^{5,17}.0^{7,18}]octadeca-7,9,11(18),15-tetraene-10-carboxamide | CHEMBL516552
TypeSmall organic molecule
Emp. Form.C20H22N2O3
Mol. Mass.338.4003
SMILESNC(=O)c1ccc2C[C@@H]3[C@@H]4C=C[C@H](O)[C@H]5Oc1c2[C@]45CCN3CC=C