Reaction Details
TargetKappa-type opioid receptor
LigandBDBM50254566
Substrate/Competitorn/a
Meas. Tech.ChEMBL_558762 (CHEMBL1019891)
IC50 640±n/a nM
Citation Wentland, MPLou, RLu, QBu, YVanAlstine, MACohen, DJBidlack, JM Syntheses and opioid receptor binding properties of carboxamido-substituted opioids. Bioorg Med Chem Lett19:203-8 (2008) 
 
Kappa-type opioid receptor
Name:Kappa-type opioid receptor
Type:G Protein-Coupled Receptor (GPCR)
Mol. Mass.:42648.76
Organism:Homo sapiens (Human)
Description:P41145
Residue:380
BDBM50254566
NameBDBM50254566
Synonyms:6,11-Dimethyl-3-phenethyl-1,2,3,4,5,6-hexahydro-2,6-methano-benzo[d]azocine-8-carboxylic acid amide | CHEMBL464230
TypeSmall organic molecule
Emp. Form.C23H28N2O
Mol. Mass.348.4812
SMILESCC1C2Cc3ccc(cc3C1(C)CCN2CCc1ccccc1)C(N)=O