Reaction Details
TargetMu-type opioid receptor
LigandBDBM50027366
Substrate/Competitorn/a
Meas. Tech.ChEMBL_558759 (CHEMBL1019888)
IC50 130±n/a nM
Citation Wentland, MPLou, RLu, QBu, YVanAlstine, MACohen, DJBidlack, JM Syntheses and opioid receptor binding properties of carboxamido-substituted opioids. Bioorg Med Chem Lett19:203-8 (2008) 
 
Mu-type opioid receptor
Name:Mu-type opioid receptor
Type:G Protein-Coupled Receptor (GPCR)
Mol. Mass.:44789.51
Organism:Homo sapiens (Human)
Description:P35372
Residue:400
BDBM50027366
NameBDBM50027366
Synonyms:Ketazocine US10865186, Compound Ketazocine WIN-34276
TypeSmall organic molecule
Emp. Form.C18H23NO2
Mol. Mass.285.3807
SMILES[H][C@@]12[C@H](C)[C@@](C)(CCN1CC1CC1)c1cc(O)ccc1C2=O