Reaction Details
TargetMu-type opioid receptor
LigandBDBM50176263
Substrate/Competitorn/a
Meas. Tech.ChEMBL_558757 (CHEMBL1019886)
Ki 8.6±n/a nM
Citation Wentland, MPLou, RLu, QBu, YVanAlstine, MACohen, DJBidlack, JM Syntheses and opioid receptor binding properties of carboxamido-substituted opioids. Bioorg Med Chem Lett19:203-8 (2008) 
 
Mu-type opioid receptor
Name:Mu-type opioid receptor
Type:G Protein-Coupled Receptor (GPCR)
Mol. Mass.:44789.51
Organism:Homo sapiens (Human)
Description:P35372
Residue:400
BDBM50176263
NameBDBM50176263
Synonyms:3-((1R,2R)-2-((dimethylamino)methyl)-1-hydroxycyclohexyl)phenol O-DESMETHYL TRAMADOL rel-3-((1R,2R)-2-((dimethylamino)methyl)-1-hydroxycyclohexyl)phenol
TypeSmall organic molecule
Emp. Form.C15H23NO2
Mol. Mass.249.3486
SMILESCN(C)C[C@H]1CCCC[C@]1(O)c1cccc(O)c1