Reaction Details
TargetMu-type opioid receptor
LigandBDBM50254563
Substrate/Competitorn/a
Meas. Tech.ChEMBL_558752 (CHEMBL1019881)
Ki 1.2±n/a nM
Citation Wentland, MPLou, RLu, QBu, YVanAlstine, MACohen, DJBidlack, JM Syntheses and opioid receptor binding properties of carboxamido-substituted opioids. Bioorg Med Chem Lett19:203-8 (2008) 
 
Mu-type opioid receptor
Name:Mu-type opioid receptor
Type:Enzyme Catalytic Domain
Mol. Mass.:11165.58
Organism:GUINEA PIG
Description:P97266
Residue:98
BDBM50254563
NameBDBM50254563
Synonyms:3-Cyclopropylmethyl-6-ethyl-11-methyl-1-oxo-1,2,3,4,5,6-hexahydro-2,6-methano-benzo[d]azocine-8-carboxylic acid amide | CHEMBL461229
TypeSmall organic molecule
Emp. Form.C20H26N2O2
Mol. Mass.326.4326
SMILESCCC12CCN(CC3CC3)C(C1C)C(=O)c1ccc(cc21)C(N)=O