Reaction Details
TargetKappa-type opioid receptor
LigandBDBM50254564
Substrate/Competitorn/a
Meas. Tech.ChEMBL_558754 (CHEMBL1019883)
Ki 2000±n/a nM
Citation Wentland, MPLou, RLu, QBu, YVanAlstine, MACohen, DJBidlack, JM Syntheses and opioid receptor binding properties of carboxamido-substituted opioids. Bioorg Med Chem Lett19:203-8 (2008) 
 
Kappa-type opioid receptor
Name:Kappa-type opioid receptor
Type:G Protein-Coupled Receptor (GPCR)
Mol. Mass.:42744.99
Organism:Cavia porcellus (domestic guinea pig)
Description:P41144
Residue:380
BDBM50254564
NameBDBM50254564
Synonyms:(1S,5R,13R,14S,17R)-14-hydroxy-4-methyl-12-oxa-4-azapentacyclo[9.6.1.0^{1,13}.0^{5,17}.0^{7,18}]octadeca-7,9,11(18),15-tetraene-10-carboxamide | CHEMBL505011
TypeSmall organic molecule
Emp. Form.C18H20N2O3
Mol. Mass.312.363
SMILESCN1CC[C@@]23[C@H]4Oc5c2c(C[C@@H]1[C@@H]3C=C[C@@H]4O)ccc5C(N)=O