Reaction Details
TargetMu-type opioid receptor
LigandBDBM50007102
Substrate/Competitorn/a
Meas. Tech.ChEMBL_558757 (CHEMBL1019886)
EC50 2.7±n/a nM
Citation Wentland, MPLou, RLu, QBu, YVanAlstine, MACohen, DJBidlack, JM Syntheses and opioid receptor binding properties of carboxamido-substituted opioids. Bioorg Med Chem Lett19:203-8 (2008) 
 
Mu-type opioid receptor
Name:Mu-type opioid receptor
Type:G Protein-Coupled Receptor (GPCR)
Mol. Mass.:44789.51
Organism:Homo sapiens (Human)
Description:P35372
Residue:400
BDBM50007102
NameBDBM50007102
Synonyms:6,11-Dimethyl-3-(tetrahydro-furan-2-ylmethyl)-1,2,3,4,5,6-hexahydro-2,6-methano-benzo[d]azocin-8-ol MR-2034
TypeSmall organic molecule
Emp. Form.C19H27NO2
Mol. Mass.301.4232
SMILESC[C@H]1[C@H]2Cc3ccc(O)cc3[C@@]1(C)CCN2C[C@@H]1CCCO1