Reaction Details
TargetKappa-type opioid receptor
LigandBDBM50254509
Substrate/Competitorn/a
Meas. Tech.ChEMBL_558760 (CHEMBL1019889)
EC50 170±n/a nM
Citation Wentland, MPLou, RLu, QBu, YVanAlstine, MACohen, DJBidlack, JM Syntheses and opioid receptor binding properties of carboxamido-substituted opioids. Bioorg Med Chem Lett19:203-8 (2008) 
 
Kappa-type opioid receptor
Name:Kappa-type opioid receptor
Type:G Protein-Coupled Receptor (GPCR)
Mol. Mass.:42648.76
Organism:Homo sapiens (Human)
Description:P41145
Residue:380
BDBM50254509
NameBDBM50254509
Synonyms:(2S,6S,11S)-6,11-Dimethyl-3-[(R)-1-(tetrahydro-furan-2-yl)methyl]-1,2,3,4,5,6-hexahydro-2,6-methano-benzo[d]azocine-8-carboxylic acid amide | CHEMBL459746
TypeSmall organic molecule
Emp. Form.C20H28N2O2
Mol. Mass.328.4485
SMILESC[C@@H]1[C@@H]2Cc3ccc(cc3[C@@]1(C)CCN2C[C@H]1CCCO1)C(N)=O