Reaction Details
TargetKappa-type opioid receptor
LigandBDBM50254573
Substrate/Competitorn/a
Meas. Tech.ChEMBL_558760 (CHEMBL1019889)
Ki 2.1±n/a nM
Citation Wentland, MPLou, RLu, QBu, YVanAlstine, MACohen, DJBidlack, JM Syntheses and opioid receptor binding properties of carboxamido-substituted opioids. Bioorg Med Chem Lett19:203-8 (2008) 
 
Kappa-type opioid receptor
Name:Kappa-type opioid receptor
Type:G Protein-Coupled Receptor (GPCR)
Mol. Mass.:42648.76
Organism:Homo sapiens (Human)
Description:P41145
Residue:380
BDBM50254573
NameBDBM50254573
Synonyms:(1S,5R,13S,17S)-4-(cyclopropylmethyl)-17-hydroxy-14-methylidene-12-oxa-4-azapentacyclo[9.6.1.0^{1,13}.0^{5,17}.0^{7,18}]octadeca-7,9,11(18)-triene-10-carboxamide | CHEMBL518083
TypeSmall organic molecule
Emp. Form.C22H26N2O3
Mol. Mass.366.4534
SMILESNC(=O)c1ccc2C[C@H]3N(CC4CC4)CC[C@@]45[C@@H](Oc1c24)C(=C)CC[C@@]35O