Reaction Details
TargetTransporter
LigandBDBM50254111
Substrate/Competitorn/a
Meas. Tech.ChEMBL_559243 (CHEMBL1014662)
Ki 35.4±n/a nM
Citation Manning, JRSexton, TChilders, SRDavies, HM 1-Naphthyl and 4-indolyl arylalkylamines as selective monoamine reuptake inhibitors. Bioorg Med Chem Lett19:58-61 (2008) 
 
Transporter
Name:Transporter
Type:Multi-pass membrane protein
Mol. Mass.:69236.90
Organism:Rattus norvegicus (rat)
Description:Q63380
Residue:617
BDBM50254111
NameBDBM50254111
Synonyms:(S)-3-(3,4-dichlorophenyl)-3-(1H-indol-4-yl)-N-methylpropan-1-amine hydrochloride | CHEMBL509403
TypeSmall organic molecule
Emp. Form.C18H18Cl2N2
Mol. Mass.333.255
SMILESCNCC[C@@H](c1ccc(Cl)c(Cl)c1)c1cccc2[nH]ccc12