Reaction Details
TargetMetabotropic glutamate receptor 5
LigandBDBM50007548
Substrate/Competitorn/a
Meas. Tech.ChEMBL_559519 (CHEMBL1018992)
Ki>1000000±n/a nM
Citation Filosa, RCarmela Fulco, MMarinozzi, MGiacchè, NMacchiarulo, APeduto, AMassa, Ade Caprariis, PThomsen, CChristoffersen, CTPellicciari, R Design, synthesis and biological evaluation of novel bicyclo[1.1.1]pentane-based omega-acidic amino acids as glutamate receptors ligands. Bioorg Med Chem17:242-50 (2008) 
 
Metabotropic glutamate receptor 5
Name:Metabotropic glutamate receptor 5
Type:Enzyme
Mol. Mass.:132484.72
Organism:Homo sapiens (Human)
Description:n/a
Residue:1212
BDBM50007548
NameBDBM50007548
Synonyms:(S)-2-Amino-4-phosphono-butyric acid 2-Amino-3-(3,5-dioxo-[1,2,4]oxadiazolidin-2-yl)-propionic acid 2-Amino-4-phosphono-butyric acid(S-AP4) 2-amino-4-phosphonobutyric acid L-(+)-2-amino-4-phosphonobutyric acid L-AP4 | L-APB
TypeSmall organic molecule
Emp. Form.C4H10NO5P
Mol. Mass.183.0997
SMILESN[C@@H](CCP(O)(O)=O)C(O)=O