Reaction Details
TargetSodium-dependent noradrenaline transporter
LigandBDBM50370475
Substrate/Competitorn/a
Meas. Tech.ChEMBL_560274 (CHEMBL1020452)
Ki 1.04±n/a nM
Citation Zeng, FMun, JJarkas, NStehouwer, JSVoll, RJTamagnan, GDHowell, LVotaw, JRKilts, CDNemeroff, CBGoodman, MM Synthesis, radiosynthesis, and biological evaluation of carbon-11 and fluorine-18 labeled reboxetine analogues: potential positron emission tomography radioligands for in vivo imaging of the norepinephrine transporter. J Med Chem52:62-73 (2009) 
 
Sodium-dependent noradrenaline transporter
Name:Sodium-dependent noradrenaline transporter
Type:Multi-pass membrane protein
Mol. Mass.:69337.72
Organism:Homo sapiens (Human)
Description:P23975
Residue:617
BDBM50370475
NameBDBM50370475
Synonyms:S,S-REBOXETINE
TypeSmall organic molecule
Emp. Form.C19H23NO3
Mol. Mass.313.3908
SMILESCCOc1ccccc1O[C@H]([C@H]1CNCCO1)c1ccccc1