Reaction Details
TargetCannabinoid receptor 1
LigandBDBM50265683
Substrate/Competitorn/a
Meas. Tech.ChEMBL_560424 (CHEMBL1015427)
EC50>10000±n/a nM
Citation Diaz, PPhatak, SSXu, JAstruc-Diaz, FCavasotto, CNNaguib, M 6-Methoxy-N-alkyl isatin acylhydrazone derivatives as a novel series of potent selective cannabinoid receptor 2 inverse agonists: design, synthesis, and binding mode prediction. J Med Chem52:433-44 (2009) 
 
Cannabinoid receptor 1
Name:Cannabinoid receptor 1
Type:G Protein-Coupled Receptor (GPCR)
Mol. Mass.:52868.96
Organism:Homo sapiens (Human)
Description:P21554
Residue:472
BDBM50265683
NameBDBM50265683
Synonyms:CHEMBL496370 | N'-[(3Z)-6-Methoxy-1-pentyl-2-oxo-1,2-dihydro-3H-indol-3-ylidene]-2,2-dimethylpropanohydrazide
TypeSmall organic molecule
Emp. Form.C19H27N3O3
Mol. Mass.345.436
SMILESCCCCCN1C(=O)C(=NNC(=O)C(C)(C)C)c2ccc(OC)cc12