Reaction Details
TargetCannabinoid receptor 2
LigandBDBM50265681
Substrate/Competitorn/a
Meas. Tech.ChEMBL_559545 (CHEMBL1019848)
EC50 43±n/a nM
Citation Diaz, PPhatak, SSXu, JAstruc-Diaz, FCavasotto, CNNaguib, M 6-Methoxy-N-alkyl isatin acylhydrazone derivatives as a novel series of potent selective cannabinoid receptor 2 inverse agonists: design, synthesis, and binding mode prediction. J Med Chem52:433-44 (2009) 
 
Cannabinoid receptor 2
Name:Cannabinoid receptor 2
Type:G Protein-Coupled Receptor (GPCR)
Mol. Mass.:39690.94
Organism:Homo sapiens (Human)
Description:P34972
Residue:360
BDBM50265681
NameBDBM50265681
Synonyms:2-Cyclohexyl-N'-[(3Z)-6-methoxy-1-pentyl-2-oxo-1,2-dihydro-3H-indol-3-ylidene]acetohydrazide | CHEMBL496369
TypeSmall organic molecule
Emp. Form.C22H31N3O3
Mol. Mass.385.4998
SMILESCCCCCN1C(=O)C(=NNC(=O)CC2CCCCC2)c2ccc(OC)cc12