Reaction Details
TargetCannabinoid receptor 2
LigandBDBM50265619
Substrate/Competitorn/a
Meas. Tech.ChEMBL_559545 (CHEMBL1019848)
EC50 18±n/a nM
Citation Diaz, PPhatak, SSXu, JAstruc-Diaz, FCavasotto, CNNaguib, M 6-Methoxy-N-alkyl isatin acylhydrazone derivatives as a novel series of potent selective cannabinoid receptor 2 inverse agonists: design, synthesis, and binding mode prediction. J Med Chem52:433-44 (2009) 
 
Cannabinoid receptor 2
Name:Cannabinoid receptor 2
Type:G Protein-Coupled Receptor (GPCR)
Mol. Mass.:39690.94
Organism:Homo sapiens (Human)
Description:P34972
Residue:360
BDBM50265619
NameBDBM50265619
Synonyms:CHEMBL495738 | N'-[(3Z)-1-(Cyclohexylmethyl)-6-methoxy-2-oxo-1,2-dihydro-3H-indol-3-ylidene]benzohydrazide
TypeSmall organic molecule
Emp. Form.C23H25N3O3
Mol. Mass.391.4629
SMILESCOc1ccc2C(=NNC(=O)c3ccccc3)C(=O)N(CC3CCCCC3)c2c1