Reaction Details
TargetCannabinoid receptor 2
LigandBDBM50265616
Substrate/Competitorn/a
Meas. Tech.ChEMBL_559553 (CHEMBL1019856)
Ki 89.9±n/a nM
Citation Diaz, PPhatak, SSXu, JAstruc-Diaz, FCavasotto, CNNaguib, M 6-Methoxy-N-alkyl isatin acylhydrazone derivatives as a novel series of potent selective cannabinoid receptor 2 inverse agonists: design, synthesis, and binding mode prediction. J Med Chem52:433-44 (2009) 
 
Cannabinoid receptor 2
Name:Cannabinoid receptor 2
Type:G Protein-Coupled Receptor (GPCR)
Mol. Mass.:39690.94
Organism:Homo sapiens (Human)
Description:P34972
Residue:360
BDBM50265616
NameBDBM50265616
Synonyms:CHEMBL497183 | N'-[(3Z)-1-Hexyl-6-methoxy-2-oxo-1,2-dihydro-3H-indol-3-ylidene]benzohydrazide
TypeSmall organic molecule
Emp. Form.C22H25N3O3
Mol. Mass.379.4522
SMILESCCCCCCN1C(=O)C(=NNC(=O)c2ccccc2)c2ccc(OC)cc12